{"text_format":"3","workbook":"xlsx","n_sheets":8,"sheets":["RESUMEN","Consolidado","HLS","HCQ","HOV","HILL","Hoja Dinámica","Filtro_DIC"],"not_rendered":{"pivot_tables":1},"read":"whole","date_system":"1900"}

{"sheet":"RESUMEN","index":0,"n_rows":30,"n_cols":11,"rows_kept":30,"merged":[[6,1,10,11],[12,1,17,1],[12,2,13,7],[12,8,13,9],[12,10,17,11],[14,3,14,6],[14,8,17,9],[15,2,17,2],[15,3,17,3],[15,4,17,4],[15,5,17,5],[15,6,17,6],[15,7,17,7],[18,1,19,1],[18,2,19,2],[18,3,19,3],[18,4,19,4],[18,5,19,5],[18,6,19,6],[18,7,19,7],[18,8,19,9],[18,10,19,11],[20,1,21,1],[20,2,21,2],[20,3,21,3],[20,4,21,4],[20,5,21,5],[20,6,21,6],[20,7,21,7],[20,8,21,9],[20,10,21,11],[22,1,23,1],[22,2,23,2],[22,3,23,3],[22,4,23,4],[22,5,23,5],[22,6,23,6],[22,7,23,7],[22,8,23,9],[22,10,23,11],[24,1,25,1],[24,2,25,2],[24,3,25,3],[24,4,25,4],[24,5,25,5],[24,6,25,6],[24,7,25,7],[24,8,25,9],[24,10,25,11],[26,1,28,1],[26,2,28,2],[26,3,28,3],[26,4,28,4],[26,5,28,5],[26,6,28,6],[26,7,28,7],[26,8,28,9],[26,10,28,11]]}
[" "]
["SERVICIO DE SALUD COQUIMBO"]
["DEPARTAMENTO  DE GESTIÓN, PLANIFICACIÓN Y CONTROL"]
["SUBDEPTO. DE ESTADÍSTICAS Y GESTIÓN DE LA INFORMACIÓN "]
["AÑO 2022"]
[]
[null,"INDICADOR 6.4: Índice de Ocupación Dental (IOD) del Servicio de Salud en el periodo."]
[]
[]
[]
[]
[]
[null,"HOSPITAL","NUMERADOR ",{"$nulls":5},"DENOMINADOR",null,"INDICADOR"]
[]
[{"$nulls":3},"Total de consultas nuevas de subespecialidades odontológicas realizadas en el periodo por rendimiento de cada subespecialidad) + (Total de controles de subespecialidades odontológicas realizados en el periodo por rendimiento de cada subespecialidad) + (Total de consultas de urgencia GES y No GES realizados en el periodo por 0,45)]",{"$nulls":4},"Denominador (*) [(Unidades dentales en dotación x 36 x Número de semanas a evaluar en el periodo) x 0,85]}."]
[null,null,"CONSULTAS URGENCIA GES","CONSULTAS URGENCIA NO GES","(CONSULTA URGENCIA GES Y NO GES) * 0.45","CONSULTA NUEVA","CONTROL","TOTAL"]
[]
[]
[null,"HOSPITAL LA SERENA",{"$f":"HLS!$R$17","v":337},{"$f":"HLS!$R$18","v":132},{"$f":"(C19+D19)*0.45","v":{"v":211.05,"d":"211"}},{"$f":"HLS!$R$48","v":5178},{"$f":"HLS!$R$49","v":19253},{"$f":"SUM(E19:G20)","v":{"v":24642.05,"d":"24642"}},null,null,{"$f":"H19/I19","v":{"$error":"#DIV/0!"}}]
[]
{"$rows_left_out":11}
{"sheet":"Consolidado","index":1,"n_rows":50,"n_cols":18,"rows_kept":50,"merged":[[7,2,10,17],[13,2,15,2],[13,3,15,4],[13,17,15,17],[16,2,17,2],[18,2,19,2],[20,2,21,2],[22,2,23,2],[24,2,25,2],[26,2,27,2],[28,2,29,2],[30,2,31,2],[32,2,33,2],[34,2,35,2],[36,2,37,2],[38,2,39,2],[40,2,41,2],[42,2,43,2],[44,2,45,2],[46,2,48,2],[46,3,46,4],[47,3,47,4],[48,3,48,4]]}
["MINISTERIO DE SALUD"]
["SERVICIO DE SALUD COQUIMBO"]
["DEPARTAMENTO  DE GESTIÓN, PLANIFICACIÓN Y CONTROL"]
["SUBDEPTO. DE ESTADÍSTICAS Y GESTIÓN DE LA INFORMACIÓN "]
["AÑO 2022"]
[]
[]
[null,null,"INDICADOR 6.4: Índice de Ocupación Dental (IOD) del Servicio de Salud en el periodo."]
[]
[]
[]
[]
[]
[null,null,"ESPECIALIDAD Y TIPO DE INGRESO O EGRESO","Región",{"$nulls":13},"TOTAL"]
[{"$nulls":5},"Enero","Febrero","Marzo","Abril","Mayo","Junio","Julio","Agosto","Septiembre","Octubre","Noviembre","Diciembre"]
[]
[null,"09240700","CONSULTAS DE URGENCIA","CONSULTAS GES",null,{"$f":"HLS!F17+HCQ!F17+HOV!F17+HILL!F17","v":61},{"$f":"HLS!G17+HCQ!G17+HOV!G17+HILL!G17","v":56},{"$f":"HLS!H17+HCQ!H17+HOV!H17+HILL!H17","v":71},{"$f":"HLS!I17+HCQ!I17+HOV!I17+HILL!I17","v":65},{"$f":"HLS!J17+HCQ!J17+HOV!J17+HILL!J17","v":78},{"$f":"HLS!K17+HCQ!K17+HOV!K17+HILL!K17","v":33},{"$f":"HLS!L17+HCQ!L17+HOV!L17+HILL!L17","v":33},{"$f":"HLS!M17+HCQ!M17+HOV!M17+HILL!M17","v":83},{"$f":"HLS!N17+HCQ!N17+HOV!N17+HILL!N17","v":27},{"$f":"HLS!O17+HCQ!O17+HOV!O17+HILL!O17","v":50},{"$f":"HLS!P17+HCQ!P17+HOV!P17+HILL!P17","v":47},{"$f":"HLS!Q17+HCQ!Q17+HOV!Q17+HILL!Q17","v":28},{"$f":"SUM(F17:Q17)","v":632}]
[null,"09600325",null,"CONSULTA NO GES",null,{"$f":"HLS!F18+HCQ!F18+HOV!F18+HILL!F18","v":86},{"$f":"HLS!G18+HCQ!G18+HOV!G18+HILL!G18","v":76},{"$f":"HLS!H18+HCQ!H18+HOV!H18+HILL!H18","v":114},{"$f":"HLS!I18+HCQ!I18+HOV!I18+HILL!I18","v":63},{"$f":"HLS!J18+HCQ!J18+HOV!J18+HILL!J18","v":83},{"$f":"HLS!K18+HCQ!K18+HOV!K18+HILL!K18","v":59},{"$f":"HLS!L18+HCQ!L18+HOV!L18+HILL!L18","v":68},{"$f":"HLS!M18+HCQ!M18+HOV!M18+HILL!M18","v":97},{"$f":"HLS!N18+HCQ!N18+HOV!N18+HILL!N18","v":74},{"$f":"HLS!O18+HCQ!O18+HOV!O18+HILL!O18","v":93},{"$f":"HLS!P18+HCQ!P18+HOV!P18+HILL!P18","v":62},{"$f":"HLS!Q18+HCQ!Q18+HOV!Q18+HILL!Q18","v":65},{"$f":"SUM(F18:Q18)","v":940}]
[null,"09600155","CIRUGÍA BUCAL","CONSULTA NUEVA ",null,{"$f":"HLS!F19+HCQ!F19+HOV!F19+HILL!F19","v":29},{"$f":"HLS!G19+HCQ!G19+HOV!G19+HILL!G19","v":28},{"$f":"HLS!H19+HCQ!H19+HOV!H19+HILL!H19","v":47},{"$f":"HLS!I19+HCQ!I19+HOV!I19+HILL!I19","v":27},{"$f":"HLS!J19+HCQ!J19+HOV!J19+HILL!J19","v":61},{"$f":"HLS!K19+HCQ!K19+HOV!K19+HILL!K19","v":49},{"$f":"HLS!L19+HCQ!L19+HOV!L19+HILL!L19","v":43},{"$f":"HLS!M19+HCQ!M19+HOV!M19+HILL!M19","v":36},{"$f":"HLS!N19+HCQ!N19+HOV!N19+HILL!N19","v":57},{"$f":"HLS!O19+HCQ!O19+HOV!O19+HILL!O19","v":87},{"$f":"HLS!P19+HCQ!P19+HOV!P19+HILL!P19","v":78},{"$f":"HLS!Q19+HCQ!Q19+HOV!Q19+HILL!Q19","v":49},591]
[null,"09600156",null,"CONTROL ",null,{"$f":"HLS!F20+HCQ!F20+HOV!F20+HILL!F20","v":106},{"$f":"HLS!G20+HCQ!G20+HOV!G20+HILL!G20","v":95},{"$f":"HLS!H20+HCQ!H20+HOV!H20+HILL!H20","v":120},{"$f":"HLS!I20+HCQ!I20+HOV!I20+HILL!I20","v":59},{"$f":"HLS!J20+HCQ!J20+HOV!J20+HILL!J20","v":140},{"$f":"HLS!K20+HCQ!K20+HOV!K20+HILL!K20","v":135},{"$f":"HLS!L20+HCQ!L20+HOV!L20+HILL!L20","v":117},{"$f":"HLS!M20+HCQ!M20+HOV!M20+HILL!M20","v":169},{"$f":"HLS!N20+HCQ!N20+HOV!N20+HILL!N20","v":106},{"$f":"HLS!O20+HCQ!O20+HOV!O20+HILL!O20","v":170},{"$f":"HLS!P20+HCQ!P20+HOV!P20+HILL!P20","v":186},{"$f":"HLS!Q20+HCQ!Q20+HOV!Q20+HILL!Q20","v":137},1540]
{"$rows_left_out":31}
{"sheet":"HLS","index":2,"n_rows":50,"n_cols":18,"rows_kept":50,"merged":[[7,2,10,17],[13,2,15,2],[13,3,15,4],[13,17,15,17],[16,2,17,2],[18,2,19,2],[20,2,21,2],[22,2,23,2],[24,2,25,2],[26,2,27,2],[28,2,29,2],[30,2,31,2],[32,2,33,2],[34,2,35,2],[36,2,37,2],[38,2,39,2],[40,2,41,2],[42,2,43,2],[44,2,45,2],[46,2,48,2],[46,3,46,4],[47,3,47,4],[48,3,48,4]]}
["MINISTERIO DE SALUD"]
["SERVICIO DE SALUD COQUIMBO"]
["DEPARTAMENTO  DE GESTIÓN, PLANIFICACIÓN Y CONTROL"]
["SUBDEPTO. DE ESTADÍSTICAS Y GESTIÓN DE LA INFORMACIÓN "]
["AÑO 2022"]
[]
[]
[null,null,"INDICADOR 6.4: Índice de Ocupación Dental (IOD) del Servicio de Salud en el periodo."]
[]
[]
[]
[]
[]
[null,null,"ESPECIALIDAD Y TIPO DE INGRESO O EGRESO","Hospital de La Serena",{"$nulls":13},"TOTAL"]
[{"$nulls":5},"Enero","Febrero","Marzo","Abril","Mayo","Junio","Julio","Agosto","Septiembre","Octubre","Noviembre","Diciembre"]
[]
[null,"09240700","CONSULTAS DE URGENCIA","CONSULTAS GES",null,48,36,37,41,38,10,18,37,17,22,22,11,{"$f":"SUM(F17:Q17)","v":337}]
[null,"09600325",null,"CONSULTA NO GES",null,27,14,16,12,11,1,12,17,2,11,3,6,{"$f":"SUM(F18:Q18)","v":132}]
[null,"09600155","CIRUGÍA BUCAL","CONSULTA NUEVA ",null,16,24,25,7,36,39,36,11,45,59,59,35,392]
[null,"09600156",null,"CONTROL ",null,75,92,75,25,89,93,104,132,76,92,118,55,1026]
{"$rows_left_out":31}
{"sheet":"HCQ","index":3,"n_rows":50,"n_cols":18,"rows_kept":50,"merged":[[7,2,10,17],[13,2,15,2],[13,3,15,4],[13,17,15,17],[16,2,17,2],[18,2,19,2],[20,2,21,2],[22,2,23,2],[24,2,25,2],[26,2,27,2],[28,2,29,2],[30,2,31,2],[32,2,33,2],[34,2,35,2],[36,2,37,2],[38,2,39,2],[40,2,41,2],[42,2,43,2],[44,2,45,2],[46,2,48,2],[46,3,46,4],[47,3,47,4],[48,3,48,4]]}
["MINISTERIO DE SALUD"]
["SERVICIO DE SALUD COQUIMBO"]
["DEPARTAMENTO  DE GESTIÓN, PLANIFICACIÓN Y CONTROL"]
["SUBDEPTO. DE ESTADÍSTICAS Y GESTIÓN DE LA INFORMACIÓN "]
["AÑO 2022"]
[]
[]
[null,null,"INDICADOR 6.4: Índice de Ocupación Dental (IOD) del Servicio de Salud en el periodo."]
[]
[]
[]
[]
[]
[null,null,"ESPECIALIDAD Y TIPO DE INGRESO O EGRESO","Hospital de Coquimbo",{"$nulls":13},"TOTAL"]
[{"$nulls":5},"Enero","Febrero","Marzo","Abril","Mayo","Junio","Julio","Agosto","Septiembre","Octubre","Noviembre","Diciembre"]
[]
[null,"09240700","CONSULTAS DE URGENCIA","CONSULTAS GES",null,3,14,19,11,23,14,8,33,6,17,19,9,{"$f":"SUM(F17:Q17)","v":176}]
[null,"09600325",null,"CONSULTA NO GES",null,17,14,37,8,19,17,21,18,10,38,14,7,{"$f":"SUM(F18:Q18)","v":220}]
[null,"09600155","CIRUGÍA BUCAL","CONSULTA NUEVA ",null,0,0,0,0,0,0,0,0,0,0,0,0,0]
[null,"09600156",null,"CONTROL ",null,0,0,1,0,0,0,0,0,0,0,0,0,1]
{"$rows_left_out":31}
{"sheet":"HOV","index":4,"n_rows":50,"n_cols":18,"rows_kept":50,"merged":[[7,2,10,17],[13,2,15,2],[13,3,15,4],[13,17,15,17],[16,2,17,2],[18,2,19,2],[20,2,21,2],[22,2,23,2],[24,2,25,2],[26,2,27,2],[28,2,29,2],[30,2,31,2],[32,2,33,2],[34,2,35,2],[36,2,37,2],[38,2,39,2],[40,2,41,2],[42,2,43,2],[44,2,45,2],[46,2,48,2],[46,3,46,4],[47,3,47,4],[48,3,48,4]]}
["MINISTERIO DE SALUD"]
["SERVICIO DE SALUD COQUIMBO"]
["DEPARTAMENTO  DE GESTIÓN, PLANIFICACIÓN Y CONTROL"]
["SUBDEPTO. DE ESTADÍSTICAS Y GESTIÓN DE LA INFORMACIÓN "]
["AÑO 2022"]
[]
[]
[null,null,"INDICADOR 6.4: Índice de Ocupación Dental (IOD) del Servicio de Salud en el periodo."]
[]
[]
[]
[]
[]
[null,null,"ESPECIALIDAD Y TIPO DE INGRESO O EGRESO","Hospital de Ovalle",{"$nulls":13},"TOTAL"]
[{"$nulls":5},"Enero","Febrero","Marzo","Abril","Mayo","Junio","Julio","Agosto","Septiembre","Octubre","Noviembre","Diciembre"]
[]
[null,"09240700","CONSULTAS DE URGENCIA","CONSULTAS GES",null,10,6,15,13,17,9,7,13,4,11,6,8,{"$f":"SUM(F17:Q17)","v":119}]
[null,"09600325",null,"CONSULTA NO GES",null,36,16,37,25,25,24,21,29,16,24,30,27,{"$f":"SUM(F18:Q18)","v":310}]
[null,"09600155","CIRUGÍA BUCAL","CONSULTA NUEVA ",null,13,4,22,20,25,10,7,25,12,28,19,14,199]
[null,"09600156",null,"CONTROL ",null,31,3,44,34,51,42,13,37,30,78,68,82,513]
{"$rows_left_out":31}
{"sheet":"HILL","index":5,"n_rows":50,"n_cols":18,"rows_kept":50,"merged":[[7,2,10,17],[13,2,15,2],[13,3,15,4],[13,17,15,17],[16,2,17,2],[18,2,19,2],[20,2,21,2],[22,2,23,2],[24,2,25,2],[26,2,27,2],[28,2,29,2],[30,2,31,2],[32,2,33,2],[34,2,35,2],[36,2,37,2],[38,2,39,2],[40,2,41,2],[42,2,43,2],[44,2,45,2],[46,2,48,2],[46,3,46,4],[47,3,47,4],[48,3,48,4]]}
["MINISTERIO DE SALUD"]
["SERVICIO DE SALUD COQUIMBO"]
["DEPARTAMENTO  DE GESTIÓN, PLANIFICACIÓN Y CONTROL"]
["SUBDEPTO. DE ESTADÍSTICAS Y GESTIÓN DE LA INFORMACIÓN "]
["AÑO 2022"]
[]
[]
[null,null,"INDICADOR 6.4: Índice de Ocupación Dental (IOD) del Servicio de Salud en el periodo."]
[]
[]
[]
[]
[]
[null,null,"ESPECIALIDAD Y TIPO DE INGRESO O EGRESO","Hospital de Illapel",{"$nulls":13},"TOTAL"]
[{"$nulls":5},"Enero","Febrero","Marzo","Abril","Mayo","Junio","Julio","Agosto","Septiembre","Octubre","Noviembre","Diciembre"]
[]
[null,"09240700","CONSULTAS DE URGENCIA","CONSULTAS GES",null,0,0,0,0,0,0,0,0,0,0,0,0,{"$f":"SUM(F17:Q17)","v":0}]
[null,"09600325",null,"CONSULTA NO GES",null,6,32,24,18,28,17,14,33,46,20,15,25,{"$f":"SUM(F18:Q18)","v":278}]
[null,"09600155","CIRUGÍA BUCAL","CONSULTA NUEVA ",null,0,0,0,0,0,0,0,0,0,0,0,0,0]
[null,"09600156",null,"CONTROL ",null,0,0,0,0,0,0,0,0,0,0,0,0,0]
{"$rows_left_out":31}
{"sheet":"Hoja Dinámica","index":6,"n_rows":49,"n_cols":18,"rows_kept":49,"hidden":true,"merged":[[7,2,10,17],[13,2,15,2],[13,3,15,4],[13,17,15,17],[16,2,17,2],[18,2,19,2],[20,2,21,2],[22,2,23,2],[24,2,25,2],[26,2,27,2],[28,2,29,2],[30,2,31,2],[32,2,33,2],[34,2,35,2],[36,2,37,2],[38,2,39,2],[40,2,41,2],[42,2,43,2],[44,2,45,2],[46,2,48,2],[46,3,46,4],[47,3,47,4],[48,3,48,4]]}
["MINISTERIO DE SALUD"]
["SERVICIO DE SALUD COQUIMBO"]
["DEPARTAMENTO  DE GESTIÓN, PLANIFICACIÓN Y CONTROL"]
["SUBDEPTO. DE ESTADÍSTICAS Y GESTIÓN DE LA INFORMACIÓN "]
["AÑO 2022"]
[]
[]
[null,null,"INDICADOR 6.4: Índice de Ocupación Dental (IOD) del Servicio de Salud en el periodo."]
[]
[]
[]
[]
[]
[null,null,"ESPECIALIDAD Y TIPO DE INGRESO O EGRESO","Hospital De La Serena",{"$nulls":13},"TOTAL"]
[{"$nulls":5},"Enero","Febrero","Marzo","Abril","Mayo","Junio","Julio","Agosto","Septiembre","Octubre","Noviembre","Diciembre"]
[]
[null,"09240700","CONSULTAS DE URGENCIA","CONSULTAS GES",null,{"$f":"IFERROR(VLOOKUP($B17,Filtro_DIC!$A$3:$N$35,2,FALSE),0)","v":48},{"$f":"IFERROR(VLOOKUP($B17,Filtro_DIC!$A$3:$N$35,3,FALSE),0)","v":36},{"$f":"IFERROR(VLOOKUP($B17,Filtro_DIC!$A$3:$N$35,4,FALSE),0)","v":37},{"$f":"IFERROR(VLOOKUP($B17,Filtro_DIC!$A$3:$N$35,5,FALSE),0)","v":41},{"$f":"IFERROR(VLOOKUP($B17,Filtro_DIC!$A$3:$N$35,6,FALSE),0)","v":38},{"$f":"IFERROR(VLOOKUP($B17,Filtro_DIC!$A$3:$N$35,7,FALSE),0)","v":10},{"$f":"IFERROR(VLOOKUP($B17,Filtro_DIC!$A$3:$N$35,8,FALSE),0)","v":18},{"$f":"IFERROR(VLOOKUP($B17,Filtro_DIC!$A$3:$N$35,9,FALSE),0)","v":37},{"$f":"IFERROR(VLOOKUP($B17,Filtro_DIC!$A$3:$N$35,10,FALSE),0)","v":17},{"$f":"IFERROR(VLOOKUP($B17,Filtro_DIC!$A$3:$N$35,11,FALSE),0)","v":22},{"$f":"IFERROR(VLOOKUP($B17,Filtro_DIC!$A$3:$N$35,12,FALSE),0)","v":22},{"$f":"IFERROR(VLOOKUP($B17,Filtro_DIC!$A$3:$N$35,13,FALSE),0)","v":11},{"$f":"SUM(F17:Q17)","v":337}]
[null,"09600325",null,"CONSULTA NO GES",null,{"$f":"IFERROR(VLOOKUP($B18,Filtro_DIC!$A$3:$N$35,2,FALSE),0)","v":27},{"$f":"IFERROR(VLOOKUP($B18,Filtro_DIC!$A$3:$N$35,3,FALSE),0)","v":14},{"$f":"IFERROR(VLOOKUP($B18,Filtro_DIC!$A$3:$N$35,4,FALSE),0)","v":16},{"$f":"IFERROR(VLOOKUP($B18,Filtro_DIC!$A$3:$N$35,5,FALSE),0)","v":12},{"$f":"IFERROR(VLOOKUP($B18,Filtro_DIC!$A$3:$N$35,6,FALSE),0)","v":11},{"$f":"IFERROR(VLOOKUP($B18,Filtro_DIC!$A$3:$N$35,7,FALSE),0)","v":1},{"$f":"IFERROR(VLOOKUP($B18,Filtro_DIC!$A$3:$N$35,8,FALSE),0)","v":12},{"$f":"IFERROR(VLOOKUP($B18,Filtro_DIC!$A$3:$N$35,9,FALSE),0)","v":17},{"$f":"IFERROR(VLOOKUP($B18,Filtro_DIC!$A$3:$N$35,10,FALSE),0)","v":2},{"$f":"IFERROR(VLOOKUP($B18,Filtro_DIC!$A$3:$N$35,11,FALSE),0)","v":11},{"$f":"IFERROR(VLOOKUP($B18,Filtro_DIC!$A$3:$N$35,12,FALSE),0)","v":3},{"$f":"IFERROR(VLOOKUP($B18,Filtro_DIC!$A$3:$N$35,13,FALSE),0)","v":6},{"$f":"SUM(F18:Q18)","v":132}]
[null,"09600155","CIRUGÍA BUCAL","CONSULTA NUEVA ",null,{"$f":"IFERROR(VLOOKUP($B19,Filtro_DIC!$A$3:$N$35,2,FALSE),0)","v":16},{"$f":"IFERROR(VLOOKUP($B19,Filtro_DIC!$A$3:$N$35,3,FALSE),0)","v":24},{"$f":"IFERROR(VLOOKUP($B19,Filtro_DIC!$A$3:$N$35,4,FALSE),0)","v":25},{"$f":"IFERROR(VLOOKUP($B19,Filtro_DIC!$A$3:$N$35,5,FALSE),0)","v":7},{"$f":"IFERROR(VLOOKUP($B19,Filtro_DIC!$A$3:$N$35,6,FALSE),0)","v":36},{"$f":"IFERROR(VLOOKUP($B19,Filtro_DIC!$A$3:$N$35,7,FALSE),0)","v":39},{"$f":"IFERROR(VLOOKUP($B19,Filtro_DIC!$A$3:$N$35,8,FALSE),0)","v":36},{"$f":"IFERROR(VLOOKUP($B19,Filtro_DIC!$A$3:$N$35,9,FALSE),0)","v":11},{"$f":"IFERROR(VLOOKUP($B19,Filtro_DIC!$A$3:$N$35,10,FALSE),0)","v":45},{"$f":"IFERROR(VLOOKUP($B19,Filtro_DIC!$A$3:$N$35,11,FALSE),0)","v":59},{"$f":"IFERROR(VLOOKUP($B19,Filtro_DIC!$A$3:$N$35,12,FALSE),0)","v":59},{"$f":"IFERROR(VLOOKUP($B19,Filtro_DIC!$A$3:$N$35,13,FALSE),0)","v":35},392]
[null,"09600156",null,"CONTROL ",null,{"$f":"IFERROR(VLOOKUP($B20,Filtro_DIC!$A$3:$N$35,2,FALSE),0)","v":75},{"$f":"IFERROR(VLOOKUP($B20,Filtro_DIC!$A$3:$N$35,3,FALSE),0)","v":92},{"$f":"IFERROR(VLOOKUP($B20,Filtro_DIC!$A$3:$N$35,4,FALSE),0)","v":75},{"$f":"IFERROR(VLOOKUP($B20,Filtro_DIC!$A$3:$N$35,5,FALSE),0)","v":25},{"$f":"IFERROR(VLOOKUP($B20,Filtro_DIC!$A$3:$N$35,6,FALSE),0)","v":89},{"$f":"IFERROR(VLOOKUP($B20,Filtro_DIC!$A$3:$N$35,7,FALSE),0)","v":93},{"$f":"IFERROR(VLOOKUP($B20,Filtro_DIC!$A$3:$N$35,8,FALSE),0)","v":104},{"$f":"IFERROR(VLOOKUP($B20,Filtro_DIC!$A$3:$N$35,9,FALSE),0)","v":132},{"$f":"IFERROR(VLOOKUP($B20,Filtro_DIC!$A$3:$N$35,10,FALSE),0)","v":76},{"$f":"IFERROR(VLOOKUP($B20,Filtro_DIC!$A$3:$N$35,11,FALSE),0)","v":92},{"$f":"IFERROR(VLOOKUP($B20,Filtro_DIC!$A$3:$N$35,12,FALSE),0)","v":118},{"$f":"IFERROR(VLOOKUP($B20,Filtro_DIC!$A$3:$N$35,13,FALSE),0)","v":55},1026]
{"$rows_left_out":30}
{"sheet":"Filtro_DIC","index":7,"n_rows":35,"n_cols":14,"rows_kept":35,"hidden":true}
["IdEstablecimiento","105100"]
[]
["Suma de Col01","Etiquetas de columna"]
["Etiquetas de fila",1,2,3,4,5,6,7,8,9,10,11,12,"Total general"]
["09240700",48,36,37,41,38,10,18,37,17,22,22,11,337]
["09600155",16,24,25,7,36,39,36,11,45,59,59,35,392]
["09600156",75,92,75,25,89,93,104,132,76,92,118,55,1026]
["09600158",45,55,53,52,61,65,42,50,67,90,90,73,743]
["09600159",120,151,210,229,193,193,136,165,140,201,208,252,2198]
["09600161",112,88,175,124,128,139,146,104,84,82,85,66,1333]
["09600162",189,153,251,172,246,180,216,223,187,226,198,190,2431]
["09600164",70,30,48,48,49,42,55,36,32,44,42,35,531]
["09600165",227,139,226,189,225,176,233,187,191,192,248,245,2478]
["09600167",11,5,9,6,11,15,7,6,8,6,14,4,102]
["09600168",52,17,35,32,50,30,20,41,30,25,26,15,373]
["09600170",31,12,42,38,52,52,68,10,0,0,43,57,405]
["09600171",216,110,309,260,327,196,345,364,82,303,292,336,3140]
["09600173",14,3,10,1,8,7,10,1,null,null,16,13,83]
["09600174",101,38,117,105,129,73,104,126,27,116,93,85,1114]
["09600178",40,43,46,33,42,102,68,66,62,81,69,56,708]
{"$rows_left_out":15}